{"text_format":"1","workbook":"xlsx","n_sheets":9,"sheets":["Calculator & BOM","OUT-IN Open Flush Bolt","OUT-IN Open Rebated","OUT-IN Opening","Product List","List","Working","DoorCalc","Pricing"],"not_rendered":{"charts":0,"images":7,"macros":1,"external_links":1,"defined_names":123,"comments":2,"pivot_tables":0},"unopened":[],"bounds":{"document_bytes":16777216,"sheet_cells":100000,"rows_first":2000,"rows_last":500,"rows_between":2000,"halvings":0,"cell_chars":16384,"cell_head_chars":4096},"cells_cut":0,"cells_raw":0,"read":"whole","date_system":"1900"}

{"sheet":"Calculator & BOM","index":0,"n_rows":109,"n_cols":62,"rows_kept":109,"cut":false,"hidden":false,"merged":[[4,0,7,0],[29,1,29,2],[30,1,30,2],[31,1,31,2],[32,1,32,2],[33,1,33,2],[28,4,28,7],[29,4,29,7],[13,1,13,2],[4,2,4,11],[21,1,21,7],[26,4,26,7],[18,9,18,10],[19,9,19,10],[20,9,20,10],[21,9,21,10],[22,9,22,10],[23,9,23,10],[24,9,24,10],[25,9,25,10],[26,9,26,10],[25,1,25,2],[26,1,26,2],[27,1,27,2],[28,1,28,2],[25,4,25,7],[27,4,27,7],[6,2,6,11],[10,1,10,2],[22,1,22,2],[23,1,23,2],[24,1,24,2],[23,4,23,7],[22,4,22,7],[24,4,24,7],[65,1,65,11],[34,4,34,7],[30,9,30,10],[31,9,31,10],[36,9,36,14],[32,4,32,7],[36,4,36,7],[33,4,33,7],[30,4,30,7],[31,4,31,7],[61,2,61,11],[62,2,62,11],[58,1,58,12],[63,2,63,9],[34,1,34,2],[60,2,60,11],[1,1,1,14],[17,1,17,2],[15,4,15,6],[17,4,17,6],[11,1,11,2],[14,1,14,2],[15,1,15,2],[16,1,16,2],[9,1,9,7],[12,1,12,2],[16,4,16,6],[3,1,3,11],[7,2,7,9],[3,12,7,14],[8,1,8,14],[5,2,5,11],[27,9,27,10],[10,37,10,40],[14,4,14,6],[13,4,13,6],[10,4,10,6],[11,4,11,6],[12,4,12,6]]}
[]
[null,"VIO Folding Door Hardware Calculator"]
[]
[null,"Customer & Project Information"]
["Use \"Tab\" key or \"Mouse\" to navigate inputs","Customer:"]
[null,"Customer ID:"]
[null,"Project:"]
[null,"Puchase Order Nº:",null,null,null,null,null,null,null,null,"Date:",{"$f":"TODAY()","v":"2021-10-15"}]
[null,null,null,null,null,null,null,null,null,null,null,null,null,null,null,null,{"$f":"SUM(Q10:Q33)","v":0}]
[null,"Opening information"]
{"$rows_left_out":100}
{"sheet":"OUT-IN Open Flush Bolt","index":1,"n_rows":189,"n_cols":29,"rows_kept":189,"cut":false,"hidden":true,"merged":[[2,23,2,24]]}
[null,"OUTWARD Opening - Flush Bolt Positioning"]
[null,"Doors Left","Doors Right"]
[{"$f":"IF(B3<>\"\",\"O\"&B3&C3,\"\")","v":"O00"},0,0,"","",null,null,null,null,null,null,null,null,null,null,null,null,null,null,null,null,null,null,"Finishes"]
[{"$f":"IF(B4<>\"\",\"O\"&B4&C4,\"\")","v":"O10"},1,0,"ML",null,null,null,null,null,null,null,null,null,null,null,null,null,null,null,null,null,null,null,"SSS","SatinStainless"]
["O20",2,0,null,"Flush Bolts",null,null,null,null,null,null,null,null,null,null,null,null,null,null,null,null,null,null,"PSS","Polished Stainless"]
["O30",3,0,null,"Flush Bolts","ML","",null,null,null,null,null,null,null,null,null,null,null,null,null,null,null,null,"BLK","Black"]
["O40",4,0,null,"Flush Bolts",null,"Flush Bolts",null,null,null,null,null,null,null,null,null,null,null,null,null,null,null,null,"WHT","White"]
["O50",5,0,null,"Flush Bolts",null,"Flush Bolts","ML","",null,null,null,null,null,null,null,null,null,null,null,null,null,null,"SNA","Satin Natural Anodised"]
["O60",6,0,null,"Flush Bolts",null,"Flush Bolts",null,"Flush Bolts"]
["O70",7,0,null,"Flush Bolts",null,"Flush Bolts",null,"Flush Bolts","ML"]
{"$rows_left_out":180}
{"sheet":"OUT-IN Open Rebated","index":2,"n_rows":189,"n_cols":25,"rows_kept":189,"cut":false,"hidden":true,"merged":[[0,1,0,2],[2,23,2,24],[98,1,98,2]]}
[null,"OUTWARD Opening"]
[null,"Doors Left","Doors Right"]
[{"$f":"IF(B3<>\"\",\"O\"&B3&C3,\"\")","v":"O00"},0,0,"","","",null,null,null,null,null,null,null,null,null,null,null,null,null,null,null,null,null,"Finishes"]
[{"$f":"IF(B4<>\"\",\"O\"&B4&C4,\"\")","v":"O10"},1,0,"VIO-1",null,null,null,null,null,null,null,null,null,null,null,null,null,null,null,null,null,null,null,"SSS","SatinStainless Steel"]
["O20",2,0,"VIO-1","VIO-3","VIO-2",null,null,null,null,null,null,null,null,null,null,null,null,null,null,null,null,null,"PSS","Polished Stainless Steel"]
["O30",3,0,"VIO-1","VIO-7","VIO-4","",null,null,null,null,null,null,null,null,null,null,null,null,null,null,null,null,"BLK","Black Powdercoat"]
["O40",4,0,"VIO-1","VIO-7","VIO-4","VIO-7","VIO-2",null,null,null,null,null,null,null,null,null,null,null,null,null,null,null,"WHT","White Powdercoat"]
["O50",5,0,"VIO-1","VIO-7","VIO-4","VIO-3","VIO-4","",null,null,null,null,null,null,null,null,null,null,null,null,null,null,"PVD","PVD"]
["O60",6,0,"VIO-1","VIO-7","VIO-4","VIO-3","VIO-4","VIO-7","VIO-2"]
["O70",7,0,"VIO-1","VIO-7","VIO-4","VIO-3","VIO-4","VIO-3","VIO-4",""]
{"$rows_left_out":180}
{"sheet":"OUT-IN Opening","index":3,"n_rows":189,"n_cols":25,"rows_kept":189,"cut":false,"hidden":true,"merged":[[0,1,0,2],[2,23,2,24],[98,1,98,2]]}
[null,"OUTWARD Opening",null,null,null,"Referrrinf to CFFS"]
[null,"Doors Left","Doors Right"]
["TAB ",0,0,"","","",null,null,null,null,null,null,null,null,null,null,null,null,null,null,null,null,null,"Finishes"]
[{"$f":"IF(B4<>\"\",\"O\"&B4&C4,\"\")","v":"O10"},1,0,"VIO-1",null,null,null,null,null,null,null,null,null,null,null,null,null,null,null,null,null,null,null,"SSS","SatinStainless Steel"]
["O20",2,0,"VIO-1","VIO-3","VIO-2",null,null,null,null,null,null,null,null,null,null,null,null,null,null,null,null,null,"PSS","Polished Stainless Steel"]
["O30",3,0,"VIO-1","VIO-7","VIO-4","",null,null,null,null,null,null,null,null,null,null,null,null,null,null,null,null,"BLK","Black Powdercoat"]
["O40",4,0,"VIO-1","VIO-7","VIO-4","VIO-7","VIO-2",null,null,null,null,null,null,null,null,null,null,null,null,null,null,null,"WHT","White Powdercoat"]
["O50",5,0,"VIO-1","VIO-7","VIO-4","VIO-3","VIO-4","",null,null,null,null,null,null,null,null,null,null,null,null,null,null,"PVD","PVD"]
["O60",6,0,"VIO-1","VIO-7","VIO-4","VIO-3","VIO-4","VIO-7","VIO-2"]
["O70",7,0,"VIO-1","VIO-7","VIO-4","VIO-3","VIO-4","VIO-3","VIO-4",""]
{"$rows_left_out":180}
{"sheet":"Product List","index":4,"n_rows":212,"n_cols":8,"rows_kept":212,"cut":false,"hidden":true,"merged":[[203,1,203,2],[146,1,146,2],[3,1,3,2],[25,1,25,2],[72,1,72,2],[155,1,155,2],[169,1,169,2],[191,1,191,2]]}
[]
[null,"Product Code","Description","Finish","Unit","Unit Rate"]
[]
[null,"Tracks & Guide Channels"]
[]
[null,"VT50-20SNA","VIO 50kg Top Track 2000mm","SNA","ea",null,"Satin Natural Anodised","SNA"]
[null,"VT50-30SNA","VIO 50kg Top Track 3000mm","SNA","ea"]
[null,"VT50-40SNA","VIO 50kg Top Track 4000mm","SNA","ea"]
[null,"VT50-50SNA","VIO 50kg Top Track 5000mm","SNA","ea"]
[]
{"$rows_left_out":203}
{"sheet":"List","index":5,"n_rows":95,"n_cols":73,"rows_kept":95,"cut":false,"hidden":true,"merged":[[0,34,0,41]]}
["Opening Width","Opening Height",null,"# Left","# Right","Weight KG","Panel Height","Track Depth (TH)","Top Clearance (TC)","Sill Clearanc (BC)","Number of Panels","Jamb-to-Jamb (Opening Width)","Jamb Clearance","Panel-to-Panel Gap","Opening Width","Panel Width",null,"Nom Panel Width","Opening Width",null,"Frame Width","Frame Height","Rough Op Width","Rough Op Height","Jamb Thickness","Head Thickness","Sill Thickness","Framing Side Gap","Framing Top Gap","Jamb Clearance","Panel-to-Panel Gap","Opening Width","Panel Width",null,"Track and Guide",null,null,null,null,null,null,null,null,null,null,null,null,null,null,"Non-Mortice",null,null,"PULLDOWN I32 & I33 = I108","Lock and Door Furniture","I108"]
[null,{"$f":"'Calculator & BOM'!User_Height","v":0},null,{"$f":"'Calculator & BOM'!Num_Left","v":0},{"$f":"'Calculator & BOM'!Num_Right","v":0},null,{"$f":"B2-H2-I2-J2","v":-62},46,7,{"$f":"9","v":9},{"$f":"D2+E2","v":0},{"$f":"IF('Calculator & BOM'!Start_With=\"Panel Width\",'Calculator & BOM'!User_Width,'Calculator & BOM'!User_Width)","v":0},12,3,{"$f":"L2-M2-(N2*D2+N2*E2)","v":-12},{"$f":"O2/K2","v":{"$error":"#DIV/0!"}},null,{"$f":"IF('Calculator & BOM'!$E$11=\"Panel Width\",'Calculator & BOM'!$E$13,\"\")","v":""},{"$f":"IFERROR(R2*K2+M2+(N2*K2),\"\")","v":""},null,null,null,null,null,null,null,null,null,null,null,null,null,null,null,null,null,null,null,null,null,null,null,null,null,null,null,{"$f":"IF('Calculator & BOM'!Start_With=\"Panel Width\",1000,16000)","v":16000},null,null,null,null,null,"No",null,"Not Required"]
["0.01-2000","v"," VT50-20",null,null,50,null,null,null,null,null,null,null,null,null,null,null,null,null,null,null,null,null,null,null,null,null,null,null,null,null,null,null,null,null,null,null,null,null,null,null,null,null,null,null,null,{"$f":"IF('Calculator & BOM'!Start_With=\"Panel Width\",1000,16000)","v":16000},null,null,null,null,null,"Euro Mortice Lock 30mm Backset","Product List B170","EML30LC","SSS","Satin Stainless Steel"]
["2000.01-3000",null," VT50-30",null,null,50,null,null,null,null,null,null,null,null,null,null,null,null,null,null,null,null,null,null,null,null,null,null,null,null,null,null,null,null,null,null,null,"Track","QTY","Guide Channel","QTY","Poly Channel Inset","QTY",null,null,null,null,null,null,"Select",null,null,"Euro Mortice Lock 30mm Backset","Product List B171","EML30LC","PSS","Polished Stainless Steel"]
["3000.01-4000",null," VT50-40",null,null,50,null,null,null,null,null,null,null,null,null,null,null,null,null,null,null,null,null,null,null,null,null,null,null,null,null,null,null,null,0,2000,"0.01-2000","VT50-20",1,"VGC-20",1,"VPCI-20",1,null,null,null,null,null,null,"Outward",null,null,"Euro Mortice Lock 30mm Backset","Product List B172","EML30LC","BLK","Black"]
["4000.01-5000",null," VT50-50",null,null,50,null,null,null,null,null,null,null,null,null,null,null,null,null,null,null,null,null,null,null,null,null,null,null,null,null,null,null,null,2000.01,3000,"2000.01-3000","VT50-30",1,"VGC-30",1,"VPCI-30",1,null,null,null,null,null,null,"Inward",null,null,null,null,null,""]
["5000.01-6000",null," VT50-30 x 2",null,null,50,null,null,null,null,null,null,null,null,null,null,null,null,null,null,null,null,null,null,null,null,null,null,null,null,null,null,null,null,3000.01,4000,"3000.01-4000","VT50-40",1,"VGC-40",1,"VPCI-40",1,null,null,null,null,null,null,null,null,null,"Euro Mortice Lock 40mm Backset","Product List B174","EML40LC","SSS","Satin Stainless Steel"]
["6000.01-7000",null," VT50-30 + VT50-40",null,null,50,null,null,null,null,null,null,null,null,null,null,null,null,null,null,null,null,null,null,null,null,null,null,null,null,null,null,null,null,4000.01,5000,"4000.01-5000","VT50-50",1,"VGC-50",1,"VPCI-50",1,null,null,null,null,null,null,"Select",null,null,"Euro Mortice Lock 40mm Backset","Product List B175","EML40LC","PSS","Polished Stainless Steel"]
["7000.01-8000",null," VT50-40 x 2",null,null,50,null,null,null,null,null,null,null,null,null,null,null,null,null,null,null,null,null,null,null,null,null,null,null,null,null,null,null,null,5000.01,6000,"5000.01-6000","VT50-30",2,"VGC-30",2,"VPCI-30",2,null,null,null,null,null,null,"Yes",null,null,"Euro Mortice Lock 40mm Backset","Product List B176","EML40LC","BLK","Black"]
["8000.01-9000",null," VT50-40 + VT50-50",null,null,50,null,null,null,null,null,null,null,null,null,null,null,null,null,null,null,null,null,null,null,null,null,null,null,null,null,null,null,null,6000.01,7000,"6000.01-7000","VT50-40",2,"VGC-40",2,"VPCI-40",2,null,null,null,null,null,null,"No",null,null,null,null,null,""]
{"$rows_left_out":86}
{"sheet":"Working","index":6,"n_rows":86,"n_cols":13,"rows_kept":86,"cut":false,"hidden":true,"merged":[]}
["Metric",{"$f":"Dimensions=\"Metric\"","v":true},null,null,"19mm Black Polypropylene","P","",null,"Finish","Part Number"]
["Conversion",{"$f":"IF(Metric,1,1/25.4)","v":1},null,null,"26mm Channel, Gold Aluminium","G","",null,"None","N/A"]
["Proprietary Metric",true,null,null,"26mm Channel, Satin Aluminium","N","",null,"Black Finish Door Catch","DCAOL"]
["Proprietary Conversion",{"$f":"IF(Proprietary_Metric,1,1/25.4)","v":1},null,null,"26mm Channel, Solid Brass","B","",null,"PVD Brass Finish Door Catch","DCATG"]
["Start with Door Size",{"$f":"Start_With=\"Panel Size\"","v":true},null,null,"Black","L","",null,"Stainless Finish Door Catch","DCAS"]
["Start with Frame Size",{"$f":"Start_With=\"Frame Size\"","v":false},null,null,"Black Anodised","L",""]
["Start with Opening",{"$f":"Start_With=\"Rough Opening\"","v":false},null,null,"Black Powdercoat","BLK","BLK",null,"Locking System"]
["Frame Width Allowance",{"$f":"Jamb_Thickness*2+IF(Start_with_Frame_Size,0,Frame_Side_Clearance*2)","v":{"$error":"#REF!"}},null,null,"Bright Chrome","C","",null,"Twinpoint"]
["Total Horizonal Allowance",{"$f":"Jamb_Thickness*2+Jamb_Clearance*2+(Total_Num_of_Panels-1)*Panel_Clearance+IF(Rebated,-Rebate_Overlap,0)","v":{"$error":"#REF!"}},null,null,"Bright Gold","G","GG",null,"Flush Bolts"]
["Total Vertical Allowance",{"$f":"Head_Thickness+Sill_Thickness+Head_Clearance+Sill_Clearance","v":{"$error":"#REF!"}},null,null,"Bronze Anodised","R",""]
{"$rows_left_out":77}
{"sheet":"DoorCalc","index":7,"n_rows":123,"n_cols":21,"rows_kept":123,"cut":false,"hidden":true,"merged":[[15,4,15,6],[14,4,14,6],[14,0,14,1],[15,0,15,1],[16,0,16,1],[16,4,16,6],[12,4,12,6],[6,0,6,1],[7,0,7,1],[8,0,8,1],[9,0,9,1],[2,0,3,7],[7,4,7,6],[6,4,6,6],[8,4,8,6],[5,4,5,7],[35,4,35,7],[95,11,95,12],[71,11,71,12],[72,11,72,12],[76,11,76,12],[77,11,77,12],[89,11,89,12],[82,11,82,12],[83,11,83,12],[54,4,54,5],[55,4,55,5],[53,4,53,5],[58,4,58,5],[56,4,56,5],[57,4,57,5],[33,4,33,7],[34,4,34,7],[32,4,32,7],[20,4,20,7],[26,4,26,7],[29,4,29,7],[31,4,31,7],[30,4,30,7],[27,4,27,7],[22,4,22,7],[25,4,25,7],[24,4,24,7],[23,4,23,7],[105,5,105,7],[59,4,59,5],[60,4,60,5],[61,4,61,5],[105,2,105,3],[31,0,31,1],[32,0,32,1],[35,0,35,1],[33,0,33,2],[34,0,34,2],[30,0,30,1],[19,0,19,1],[20,0,20,1],[25,0,25,1],[29,0,29,1],[21,0,21,1],[22,0,22,1],[23,0,23,1],[24,0,24,1],[2,8,2,9],[1,8,1,9],[26,0,26,1],[27,0,27,1],[28,0,28,1],[10,0,10,1],[11,0,11,1],[12,0,12,1],[13,0,13,1],[21,4,21,7],[13,4,13,6],[28,4,28,7],[19,4,19,7],[9,4,9,6],[10,4,10,6],[11,4,11,6]]}
["McCallum",null,null,null,null,null,null,null,null,null,null,null,null,"Ext",null,{"$f":"180*12","v":2160}]
["VIO Folding Door Hardware Calculator V1",null,null,null,null,null,null,null,"Purchase Order",null,null,null,null,null,null,{"$f":"P1*1.1","v":2376}]
[{"$f":"IF(Hardware_Finish=\"Oil Rubbed Bronze\",\"Please Note: Oil Rubbed Bronze Hardware is not available in Australia\",\"\")","v":""},null,null,null,null,null,null,null,{"$f":"\"To: \"&#REF!","v":{"$error":"#REF!"}},null,null,null,{"$f":"\"Fax \"&INDEX(#REF!,MATCH(#REF!,#REF!,0))","v":{"$error":"#REF!"}}]
[null,null,null,null,null,null,null,null,null,null,null,null,null,{"$f":"SUM(N5:N45)","v":{"$error":"#REF!"}}]
["Job information",null,null,null,null,null,null,null,"Lineals"]
[null,null,null,null,{"$f":"IF(COUNTA(C13:C14)-COUNTBLANK(C13:C14)>0,\"Red items below are incorrect\",\"\")","v":""},null,null,null,"Description",null,null,null,null,null,null,"Flush Bolt Style","Flush Bolt Style","Outwards-Straight","Inwards-Straight","Outwards-Concealed","Inwards-Concealed"]
["Manufacturer",null,null,null,"Company Name",null,null,null,{"$f":"IF(LOOKUP(ROW()-Row_Offset,#REF!)=ROW()-Row_Offset,LOOKUP(ROW()-Row_Offset,#REF!,#REF!),\"\")","v":{"$error":"#REF!"}},{"$f":"IF(I7<>\"\",LOOKUP(ROW()-Row_Offset,#REF!,#REF!),\"\")","v":{"$error":"#REF!"}},{"$f":"IF(AND(J7<>\"\",Total_Num_of_Panels<>0),LOOKUP(ROW()-Row_Offset,#REF!,#REF!),\"\")","v":{"$error":"#REF!"}},{"$f":"IF(LOOKUP(ROW()-Row_Offset,#REF!)=ROW()-Row_Offset,LOOKUP(ROW()-Row_Offset,#REF!,#REF!),\"\")","v":{"$error":"#REF!"}},{"$f":"IF(K7<>\"\",IF(INDEX(Order,VLOOKUP(J7,PriceTable,7,FALSE)+1),1,-1)*VLOOKUP(J7,PriceTable,6,FALSE),0)","v":{"$error":"#REF!"}},{"$f":"IF(M7>0,M7*K7,0)","v":{"$error":"#REF!"}},null,"<>FALSE",{"$f":"IF(Outward,IF(StraightGuide,R7,T7),IF(StraightGuide,S7,U7))","v":"Radius, 200"},"Round, 200","Round, 200","Radius, 200","Radius, 200"]
["Customer ID",null,null,null,"CN-0000123",null,null,null,{"$f":"IF(LOOKUP(ROW()-Row_Offset,#REF!)=ROW()-Row_Offset,LOOKUP(ROW()-Row_Offset,#REF!,#REF!),\"\")","v":{"$error":"#REF!"}},{"$f":"IF(I8<>\"\",LOOKUP(ROW()-Row_Offset,#REF!,#REF!),\"\")","v":{"$error":"#REF!"}},{"$f":"IF(AND(J8<>\"\",Total_Num_of_Panels<>0),LOOKUP(ROW()-Row_Offset,#REF!,#REF!),\"\")","v":{"$error":"#REF!"}},{"$f":"IF(LOOKUP(ROW()-Row_Offset,#REF!)=ROW()-Row_Offset,LOOKUP(ROW()-Row_Offset,#REF!,#REF!),\"\")","v":{"$error":"#REF!"}},{"$error":"#REF!"},{"$error":"#REF!"},null,null,"Radius, 200/200","Round, 200/400","Round, 200/400","Radius, 200/200","Radius, 200/200"]
["Start With",null,null,null,"Panel Size",null,null,null,{"$f":"IF(LOOKUP(ROW()-Row_Offset,#REF!)=ROW()-Row_Offset,LOOKUP(ROW()-Row_Offset,#REF!,#REF!),\"\")","v":{"$error":"#REF!"}},{"$f":"IF(I9<>\"\",LOOKUP(ROW()-Row_Offset,#REF!,#REF!),\"\")","v":{"$error":"#REF!"}},{"$f":"IF(AND(J9<>\"\",Total_Num_of_Panels<>0),LOOKUP(ROW()-Row_Offset,#REF!,#REF!),\"\")","v":{"$error":"#REF!"}},{"$f":"IF(LOOKUP(ROW()-Row_Offset,#REF!)=ROW()-Row_Offset,LOOKUP(ROW()-Row_Offset,#REF!,#REF!),\"\")","v":{"$error":"#REF!"}},{"$error":"#REF!"},{"$error":"#REF!"},null,null,"Radius, 400/200","Round, 200/600","Round, 200/600","Radius, 400/200","Radius, 400/200"]
["Dimensions",null,null,null,"Metric",null,null,{"$f":"IF(Metric,\"(mm)\",\"(inches)\")","v":"(mm)"},{"$f":"IF(LOOKUP(ROW()-Row_Offset,#REF!)=ROW()-Row_Offset,LOOKUP(ROW()-Row_Offset,#REF!,#REF!),\"\")","v":{"$error":"#REF!"}},{"$f":"IF(I10<>\"\",LOOKUP(ROW()-Row_Offset,#REF!,#REF!),\"\")","v":{"$error":"#REF!"}},{"$f":"IF(AND(J10<>\"\",Total_Num_of_Panels<>0),LOOKUP(ROW()-Row_Offset,#REF!,#REF!),\"\")","v":{"$error":"#REF!"}},{"$f":"IF(LOOKUP(ROW()-Row_Offset,#REF!)=ROW()-Row_Offset,LOOKUP(ROW()-Row_Offset,#REF!,#REF!),\"\")","v":{"$error":"#REF!"}},{"$error":"#REF!"},{"$error":"#REF!"},null,null,"Radius, 600/200","Round, 200/1000","Round, 200/1000","Radius, 600/200","Radius, 600/200"]
{"$rows_left_out":114}
{"sheet":"Pricing","index":8,"n_rows":359,"n_cols":7,"rows_kept":359,"cut":false,"hidden":true,"merged":[]}
[]
[null,null,"Trade Discount",null,null,0]
[null,null,"Price List",null,null,"List"]
[]
["Product Code","Unit","Description","Trade","SLP","Pricing","Category"]
[null,null,null,"ExGst","ExGst","Inc Gst"]
[]
["Pivot Sets"]
["E22PSN","ea","Pivot set natural",50,0,{"$f":"IF(D9<>\"\",ROUND(IF($F$3=\"SLP\",IF(E9<>\"\",E9,D9),D9)*1.1,2),\"\")","v":55},1]
["E22PSG","ea","Pivot set gold",55,0,60.5,1]
{"$rows_left_out":349}